1. 阿里云>
  2. 云栖社区>
  3. 主题地图>
  4. A>
  5. api error: failed

当前主题:api error: failed

api error: failed相关的博客

查看更多 写博客

(转)Android Studio Error:Failed to resolve: com.android.support:appcompat-v7:25.1.0解决方案

今天不知道为什么导入eclipse项目后就出现了错误,没导入之前是正常使用AS的 Error:(26, 13) Failed to resolve: com.android.support:appcompat-v7:25.+ 第一、点击Install Rep

阅读全文

Error:Execution failed for task ':app:transformClassesWithDexForDebug'解决记录

3个错误non-zero exit value 1; non-zero exit value 2; non-zero exit value 3 Error:Execution failed for task ':app:transformClassesWit

阅读全文

Spark Shell启动时遇到<console>:14: error: not found: value spark import spark.implicits._ <console>:14: error: not found: value spark import spark.sql错误的解决

 这里我,使用的是spark-2.2.0-bin-hadoop2.6.tgz + hadoop-2.6.0.tar.gz 的单节点来测试下。   其中,hadoop-2.6.0的单节点配置文件,我就不赘述了。     这里,我重点写下spark on yarn

阅读全文

Installation error: INSTALL_FAILED_OLDER_SDK

解决对策:                  1.删除bin/res           2.删除AndroidManifest.xml中<uses-sdk android:minSDKVersion="4" />           3.新建一个API L

阅读全文

Android Studio 解决:error adding symbols: File in wrong format clang++.exe: error: linker command...

错误日志: Error:FAILURE: Build failed with an exception. * What went wrong: Execution failed for task ':app:externalNativeBuildDebug'

阅读全文

$ gradle packageDebug --stacktrace error: top-left corner pixel must be either opaque white or transparent.

$ gradle packageDebug --stacktrace error: top-left corner pixel must be either opaque white or transparent. Configure project :ap

阅读全文

ERROR : Error appeared during Puppet run: x.x.x.x _keystone.pp

报错 1 2 3 4 ERROR : Error appeared during Puppet run: x.x.x.x_keystone.pp Error: /Stage[main]/Keystone::Db::Sync/Exec[keystone-man

阅读全文

Adb connection Error:远程主机强迫关闭了一个现有的连接

做android开发的时候eclipse的console一直出现这个问题,有时候是启动eclipse后就出现这个问题,有时候是运行android程序的时候出现的,重启avd和重启eclipse都不行。后面在网上找到了解决办法。 先说原因嘛,这是ddms调用a

阅读全文

api error: failed相关问答

查看更多 提问题

docker-machine create -d aliyunecs dev1报错

``` Error creating machine: Error in driver during machine creation: dev1 | Failed to create instance: Aliyun API Error: RequestI

阅读全文

使用docker machine 添加主机的时候出现The specified parameter "Password" is not valid.的问题

按照官方例子,我配置如下 ```bash export DEBUG=true export ECS_ACCESS_KEY_ID=xxxxxxxxxxxxxxxxx export ECS_ACCESS_KEY_SECRET=xxxxxxxxxxxxx

阅读全文

运行算法平台出错,什么原因?

日志如下: [1] execute endpoint : http://service.odps.aliyun.com/api [1] OK [1] ID = 20170410144409485gtij7bjc2 [1] Odps Instan

阅读全文

关于android: 遇到了一个eclipse工程转到studio上的问题?

我在把项目由eclipse导到studio的时候遇到了一个问题,如下: ` Error:Execution failed for task ':app:transformClassesWithDexForDebug'. com.androi

阅读全文

直播和点播sdk中jar冲突

播放sdk中的alivc-player-2.2.0.13.jar包和点播AliyunVodPlayer.aar包中都有NDKCallback.class这个类 Error:Execution failed for task ':app:transformCla

阅读全文

关于android导入第三方包后出错 !

出现如下错误 ``` Error:Execution failed for task ':app:transformResourcesWithMergeJavaResForDebug'. com.android.build.api.transform

阅读全文

求助:cdh安装完成后,hue无法连接thrift

cdh安装完成后,hue无法连接thrift hue平台的报错是:HBase Browser Failed to authenticate to HBase Thrift Server, check authentication configurations

阅读全文

求助:深度学习PAI‘格式转换’组件运行失败!

我要使用Caffe 框架进行图片识别,使用前要先对图片进行转换,但是设置好后运行失败,具体的配置如下: 1.在oss中传入图片放在‘tp01’文件夹中, ![0003](https://yqfile.alicdn.com/a3f5e6b2ad2011d

阅读全文