1. 阿里云>
  2. 云栖社区>
  3. 主题地图>
  4. [>
  5. [sapi/cli/php] error 1

当前主题:[sapi/cli/php] error 1

[sapi/cli/php] error 1相关的博客

查看更多 写博客

安装PHP出现make: *** [sapi/cli/php] Error 1 解决办法

ext/iconv/.libs/iconv.o: In function `php_iconv_stream_filter_ctor':/home/king/php-5.2.13/ext/iconv/iconv.c:2491: undefined refere

阅读全文

安装PHP出现make: *** [sapi/cli/php] Error 1 解决办法

ext/iconv/.libs/iconv.o: In function `php_iconv_stream_filter_ctor':/home/king/php-5.2.13/ext/iconv/iconv.c:2491: undefined refere

阅读全文

make: *** [ext/mysqli/mysqli.lo] Error 1

编译安装php 的时候, 执行make报错误 错误:make: *** [ext/mysqli/mysqli.lo] Error 1 [root@localhost php-5.4.9]# mkdir /usr/local/webserver/mysql/i

阅读全文

undefined reference to libiconv_open ext/iconv/.libs/iconv.o by install phpsource

错误信息:ext/iconv/.libs/iconv.o(.text+0x30e2): In function `php_iconv_stream_filter_factory_create':/home/jjdai/work/zhupiter/php-5.

阅读全文

centos5安装PHP5时遇到问题

PHP版本:5.3.1,操作系统:centos5.4 手动编译安装GD,然后在安装PHP时指定GD安装路径,configure通过,make通过,make test无法通过: imagecopyresampled() [ext/gd/tests/imagec

阅读全文

PHP编译,执行make报错

编译安装php 的时候, 执行make报错误 make: *** [ext/phar/phar.php] 错误 127 [root@localhost php-5.4.9]# mkdir /usr/local/webserver/mysql/include/m

阅读全文

PHP编译,执行make报错

编译安装php 的时候, 执行make报错误 make: *** [ext/phar/phar.php] 错误 127 [root@localhost php-5.4.9]# mkdir /usr/local/webserver/mysql/include/m

阅读全文

php安装make报错信息及解决方法

1 2 3 4 5 6 7 8 9 10 11 12 13 14 make错误 Generating phar.phar /root/php-5.3.27/sapi/cli/php:error while loading shared libraries:

阅读全文

[sapi/cli/php] error 1相关问答

提问题

如何安装 php 的zip模块

如何安装 php 的zip模块,详细方法。 我按照下面方法安装: cd /usr/src wget http://pecl.php.net/get/zip tar -zxvf zip cd zip-1.x.x phpize

阅读全文