1. 云栖社区>
  2. PHP教程>
  3. 正文

ubuntu系统 编译libxml2的库是遇到如下错误

作者:用户 来源:互联网 时间:2017-12-01 17:55:27

ubuntu编译系统错误遇到如下libxml2

ubuntu系统 编译libxml2的库是遇到如下错误 - 摘要: 本文讲的是ubuntu系统 编译libxml2的库是遇到如下错误,大家好: 我买了细说PHP书来学习。在搭建环境时使用的是ubuntu系统编译libxml2的库是遇到如下错误,In function 'open', inlined from 'xmlNanoHTTPSave__internal_alias

大家好:
我买了细说PHP书来学习。在搭建环境时使用的是ubuntu系统
编译libxml2的库是遇到如下错误,
In function 'open',
inlined from 'xmlNanoHTTPSave__internal_alias' at nanohttp.c:1588:12:
/usr/include/x86_64-linux-gnu/bits/fcntl2.h:51:24: error: call to '__open_missing_mode' declared with attribute error: open with O_CREAT in second argument needs 3 arguments
make[2]: *** [nanohttp.lo] Error 1
make[2]: Leaving directory `/home/waveshare/work/PHP/libxml2-2.6.30'
make[1]: *** [all-recursive] Error 1
make[1]: Leaving directory `/home/waveshare/work/PHP/libxml2-2.6.30'
make: *** [all] Error 2
求解决。。。。。。

以上是ubuntu系统 编译libxml2的库是遇到如下错误的全部内容,在云栖社区的博客、问答、公众号、人物、课程等栏目也有其他相关内容,欢迎继续使用右上角搜索按钮进行搜索ubuntu , 编译 , 系统 , 错误 , 遇到 , 如下 libxml2 ,以便于您获取更多的相关知识。