PHP编译,执行make报错

  1. 云栖社区>
  2. 博客>
  3. 正文

PHP编译,执行make报错

科技探索者 2017-11-14 20:28:00 浏览493
展开阅读全文

编译安装php 的时候, 执行make报错误

make: *** [ext/phar/phar.php] 错误 127


[root@localhost php-5.4.9]# mkdir /usr/local/webserver/mysql/include/mysql

 [root@localhost php-5.4.9]# ln -s /usr/local/webserver/mysql/include/* /usr/local/webserver/mysql/include/mysql

 [root@localhost php-5.4.9]# make ZEND_EXTRA_LIBS='-liconv'

抛错:

Generating phar.phar

/usr/local/src/php-5.4.9/sapi/cli/php: error while loading shared libraries: libiconv.so.2: cannot open shared object file: No such file or directory

make: *** [ext/phar/phar.php] Error 127


解决的方法如下:

#vi /etc/ld.so.conf

在里面加上一行

/usr/local/lib

2.然后运行/sbin/ldconfig

#/sbin/ldconfig

编译make

#make ZEND_EXTRA_LIBS='-liconv'

抛错:

Generating phar.phar

chmod: cannot access `ext/phar/phar.phar': No such file or directory

make: [ext/phar/phar.phar] Error 1 (ignored)


Build complete.

Don't forget to run 'make test'.

此处可以忽略 不过解决办法如下

#cd  ext/phar/

#cp ./phar.php  ./phar.phar

然后到php5.4文件夹

#make ZEND_EXTRA_LIBS='-liconv'

#make test

#make install

本文转自xinsz08の平行时空博客51CTO博客,原文链接http://blog.51cto.com/xinsz08/1795767如需转载请自行联系原作者

维度2018

网友评论

登录后评论
0/500
评论
科技探索者
+ 关注